{"text_format":"1","workbook":"xlsx","n_sheets":19,"sheets":["Содержание","Реестр","Инструктажи","Реестр проверок знаний","Протокол","Стажировка","Стажировка_tmp","Допуск к работе","Допуск к работе_tmp","МЕТКИ для шаблонов","Данные о работниках","Данные для протокола","Комиссия","Программы обучения","Проведение стажировки","Решение о допуске к работе","Настройки напоминаний","Должности","Руководители подразделений"],"not_rendered":{"charts":0,"images":1,"macros":1,"external_links":0,"defined_names":23,"comments":0,"pivot_tables":0},"unopened":[],"bounds":{"document_bytes":16777216,"sheet_cells":100000,"rows_first":2000,"rows_last":500,"rows_between":2000,"halvings":0,"cell_chars":16384,"cell_head_chars":4096},"cells_cut":0,"cells_raw":0,"read":"whole","date_system":"1900"}

{"sheet":"Содержание","index":0,"n_rows":21,"n_cols":3,"rows_kept":21,"cut":false,"hidden":false,"merged":[]}
[]
[null,"Полное наименование организации","Общество с ограниченной ответственностью «Гамма»"]
[null,"Краткое наименование организации","ООО «Гамма»"]
[null,"Руководитель организации - Должность","Генеральный директор"]
[null,"Руководитель организации - Ф.И.О","Тагилов В.В."]
[]
["Работа с программой"]
[1,"Реестр","Реестр обучений по охране труда"]
[2,"Инструктажи","Данные об инструктажах, их периодичности и сроках"]
[3,"Реестр проверок знаний","Реестр проверок знаний"]
[4,"Протокол","Протокол проверки знаний"]
[5,"Стажировка","Приказ о стажировке"]
[6,"Допуск к работе","Приказ о допуске к работе"]
[7,"Данные о работниках","Данные о работниках"]
[8,"Данные для протокола","Формирование протокола"]
{"$rows_left_out":7}
{"sheet":"Реестр","index":1,"n_rows":9,"n_cols":13,"rows_kept":9,"cut":false,"hidden":false,"merged":[]}
["Ф.И.О. работника","Должность работника ","Наименование подразделения (цех, участок, отдел, лаборатория, мастерская)","Вводный инструктаж по охране труда","Инструктаж по охране труда на рабочем месте","Повторный инструктаж по охране труда на рабочем месте","Программа обучения","№ протокола проверки знаний","Регистрационный номер записи о проверке знаний в реестре обученных лиц","Дата проверки знаний","Дата следующей проверки знаний","№ приказа о стажировке","№ приказа о допуске к самостоятельной работе "]
["Агафонов Илья Михайлович","Сигналист","Линейный участок № 9","2022-11-01","2022-11-01","2023-05-01","Программа обучения безопасным методам и приемам выполнения работ при воздействии вредных, опасных производственных факторов, источников опасности, идентифицированных в рамках спецоценки и оценки профрисков при работе для сигналиста (программа Б)","12","12","2022-11-02","2025-11-02","23/ст"]
["Алексеев Дмитрий Андреевич","Монтер пути","Линейный участок № 11","2022-11-01","2022-11-01","2023-05-01","Программа обучения безопасным методам и приемам выполнения работ при воздействии вредных, опасных производственных факторов, источников опасности, идентифицированных в рамках спецоценки и оценки профрисков при работе для монтера пути (программа Б)","13",null,"2022-11-02","2025-11-02","",""]
["Алексеева Людмила Алексеевна","Ведущий технолог","Линейный участок № 3","2018-09-26","2022-11-25","2023-02-25",null,"",null,null,null,"","445"]
["Александров Максим Николаевич","Начальник отдела","Производственно-технический отдел","2017-04-01","2022-11-22","2023-05-22",null,""]
["Попов Дмитрий Сергеевич","Начальник участка","Линейный участок № 3",null,null,null,null,""]
["Мальков Иван Владимирович","Начальник цеха","Цех № 7",null,null,null,null,""]
["Иванов Иван Иванович","Начальник производственного участка","Производственный участок",null,null,null,null,""]
["Петров Петр Петрович","Сигналист","Производственный участок",null,null,null,null,"",null,null,null,"",""]

{"sheet":"Инструктажи","index":2,"n_rows":9,"n_cols":7,"rows_kept":9,"cut":false,"hidden":false,"merged":[]}
["Ф.И.О. работника","Должность работника","Наименование подразделения (цех, участок, отдел, лаборатория, мастерская и т.д.)","Вводный инструктаж по охране труда","Инструктаж по охране труда на рабочем месте","Повторный инструктаж по охране труда на рабочем месте","Периодичность"]
["Агафонов Илья Михайлович","Сигналист","Линейный участок № 9","2022-11-01","2022-11-01","2023-05-01","1 раз в 6 месяцев"]
["Александров Максим Николаевич","Начальник отдела","Производственно-технический отдел","2017-04-01","2022-11-22","2023-05-22","1 раз в 6 месяцев"]
["Алексеев Дмитрий Андреевич","Монтер пути","Линейный участок № 11","2022-11-01","2022-11-01","2023-05-01","1 раз в 6 месяцев"]
["Алексеева Людмила Алексеевна","Ведущий технолог","Линейный участок № 3","2018-09-26","2022-11-25","2023-02-25","1 раз в 3 месяца"]
["Попов Дмитрий Сергеевич","Начальник участка","Линейный участок № 3"]
["Мальков Иван Владимирович","Начальник цеха","Цех № 7"]
["Иванов Иван Иванович","Начальник производственного участка","Производственный участок"]
["Петров Петр Петрович","Сигналист","Производственный участок"]

{"sheet":"Реестр проверок знаний","index":3,"n_rows":9,"n_cols":8,"rows_kept":9,"cut":false,"hidden":false,"merged":[]}
["Ф.И.О. работника","Должность работника ","Наименование подразделения (цех, участок, отдел, лаборатория, мастерская)","Программа обучения ","Дата проверки знаний","Дата следующей проверки знаний","№ протокола","Регистрационный номер записи о проверке знаний в реестре обученных лиц"]
["Агафонов Илья Михайлович","Линейный участок № 9","Сигналист","Программа обучения безопасным методам и приемам выполнения работ при воздействии вредных, опасных производственных факторов, источников опасности, идентифицированных в рамках спецоценки и оценки профрисков при работе для сигналиста (программа Б)","2022-11-02","2025-11-02",12,12]
["Алексеев Дмитрий Андреевич","Линейный участок № 11","Монтер пути","Программа обучения безопасным методам и приемам выполнения работ при воздействии вредных, опасных производственных факторов, источников опасности, идентифицированных в рамках спецоценки и оценки профрисков при работе для монтера пути (программа Б)","2022-11-02","2025-11-02",13]
["Алексеева Людмила Алексеевна","Линейный участок № 3","Ведущий технолог"]
["Александров Максим Николаевич","Производственно-технический отдел","Начальник отдела"]
["Попов Дмитрий Сергеевич","Линейный участок № 3","Начальник участка"]
["Мальков Иван Владимирович","Цех № 7","Начальник цеха"]
["Иванов Иван Иванович","Производственный участок","Начальник производственного участка"]
["Петров Петр Петрович","Производственный участок","Сигналист"]

{"sheet":"Протокол","index":4,"n_rows":28,"n_cols":10,"rows_kept":28,"cut":false,"hidden":false,"merged":[[27,3,27,6],[22,3,22,6],[23,3,23,6],[24,3,24,6],[25,3,25,6],[26,3,26,6],[15,0,15,6],[0,0,0,6],[1,0,1,6],[2,0,2,6],[6,2,6,6],[7,2,7,6],[8,2,8,6],[9,2,9,6],[10,2,10,6],[11,2,11,6],[14,0,14,6],[13,2,13,6]]}
[{"$f":"\"ПРОТОКОЛ  № \"&IF(J1=\"\",\"_____\",J1)&CHAR(10)&\" \nПРОВЕРКИ ЗНАНИЯ ТРЕБОВАНИЙ ОХРАНЫ ТРУДА РАБОТНИКОВ\"","v":"ПРОТОКОЛ  № 12\n \nПРОВЕРКИ ЗНАНИЯ ТРЕБОВАНИЙ ОХРАНЫ ТРУДА РАБОТНИКОВ"},null,null,null,null,null,null,null,"Укажите номер протокола:",12]
[{"$f":"IF(Содержание!C2=\"\",\"\",Содержание!C2)","v":"Общество с ограниченной ответственностью «Гамма»"}]
["(полное наименование организации)"]
["В соответствии с приказом работодателя от 01.09.2022 № 01/11-2022 комиссия в составе:"]
[]
[]
["Председателя комиссии",null,"Чубарев Сергей Петрович, главный инженер"]
[null,null,"(Ф.И.О., должность)"]
["Членов комиссии:",null,"Татаркин Олег Петрович, руководитель производственного отдела"]
[null,null,"(Ф.И.О., должность)"]
[null,null,"Островская Оксана Викторовна, руководитель службы охраны труда"]
[null,null,"(Ф.И.О., должность)"]
[]
[null,"2022-11-02","года провела проверку  знаний  требований  охраны  труда  работников по "]
["Программе обучения безопасным методам и приемам выполнения работ при воздействии вредных, опасных производственных факторов, источников опасности, идентифицированных в рамках спецоценки и оценки профрисков при работе для сигналиста (программа Б)"]
{"$rows_left_out":14}
{"sheet":"Стажировка","index":5,"n_rows":38,"n_cols":9,"rows_kept":38,"cut":false,"hidden":false,"merged":[[21,1,21,8],[23,1,23,8],[25,1,25,8],[1,0,1,8],[2,0,2,8],[4,0,4,8],[13,1,13,8],[16,1,16,7],[17,1,17,8],[18,1,18,8]]}
[]
[{"$f":"IF(Содержание!$C$2=\"\",\"\",Содержание!$C$2)","v":"Общество с ограниченной ответственностью «Гамма»"}]
["(полное наименование организации)"]
[]
["ПРИКАЗ"]
[]
[null,"02.11.2022",null,null,null,null,null,"№","23/ст"]
[]
[]
[]
[]
[null,"О проведении стажировки вновь принятому работнику"]
[]
[null,"В соответствии с требованиями Постановления Правительства РФ от 24.12.2021 № 2464 «О порядке обучения по охране труда и проверки знания требований охраны труда», в целях проведения стажировки и обучения вновь принятого работника: Сигналиста Агафонова Илью Михайловича"]
[]
{"$rows_left_out":24}
{"sheet":"Стажировка_tmp","index":6,"n_rows":38,"n_cols":8,"rows_kept":38,"cut":false,"hidden":true,"merged":[[1,0,1,8],[2,0,2,8],[4,0,4,8],[25,1,25,8],[13,1,13,8],[16,1,16,7],[17,1,17,8],[18,1,18,8],[21,1,21,8],[23,1,23,8]]}
[]
[{"$f":"IF(LEFT(Содержание!$C$2,7)=\"\",\"\",Содержание!$C$2)","v":"Общество с ограниченной ответственностью «Гамма»"}]
["(полное наименование организации)"]
[]
["ПРИКАЗ"]
[]
[null,"{order_date}",null,null,null,null,null,"№"]
[]
[]
[]
[]
[null,"О проведении стажировки вновь принятому работнику"]
[]
[null,"В соответствии с требованиями Постановления Правительства РФ от 24.12.2021 № 2464 «О порядке обучения по охране труда и проверки знания требований охраны труда», в целях проведения стажировки и обучения вновь принятого работника: {должность_стажируемого_в_вин} {фио_стажируемого_в_вин}"]
[]
{"$rows_left_out":24}
{"sheet":"Допуск к работе","index":7,"n_rows":30,"n_cols":9,"rows_kept":30,"cut":false,"hidden":false,"merged":[[28,1,28,4],[14,1,14,7],[16,1,16,8],[18,1,18,8],[9,1,9,8],[26,1,26,4],[1,0,1,8],[2,0,2,8],[4,0,4,8],[5,1,5,8],[11,1,11,8]]}
[]
[{"$f":"IF(Содержание!$C$2=\"\",\"\",Содержание!$C$2)","v":"Общество с ограниченной ответственностью «Гамма»"}]
["(полное наименование организации)"]
[]
["ПРИКАЗ"]
[null,"о допуске к самостоятельной работе"]
[]
[null,"08.11.2022",null,null,null,null,null,"№","445"]
[]
[null,"О допуске к самостоятельной работе Ведущего технолога Алексееву Людмилу Алексеевну"]
[]
[null,"После прохождения инструктажей, обучения и проверки знания требований охраны труда и стажировки на рабочем месте с освоением необходимых операций Ведущему технологу Алексеевой Людмилой Алексеевной"]
[]
[]
[null,"ПРИКАЗЫВАЮ:"]
{"$rows_left_out":16}
{"sheet":"Допуск к работе_tmp","index":8,"n_rows":30,"n_cols":8,"rows_kept":30,"cut":false,"hidden":true,"merged":[[28,1,28,4],[26,1,26,4],[16,1,16,8],[18,1,18,8],[1,0,1,8],[2,0,2,8],[4,0,4,8],[5,1,5,8],[11,1,11,8],[14,1,14,7],[9,1,9,8]]}
[]
[{"$f":"IF(LEFT(Содержание!$C$2,7)=\"\",\"\",Содержание!$C$2)","v":"Общество с ограниченной ответственностью «Гамма»"}]
["(полное наименование организации)"]
[]
["ПРИКАЗ"]
[null,"о допуске к самостоятельной работе"]
[]
[null,"{order_date}",null,null,null,null,null,"№"]
[]
[null,"О допуске к самостоятельной работе {должность_допускаемого_в_вин} {фио_допускаемого_в_вин}"]
[]
[null,"После прохождения инструктажей, обучения и проверки знания требований охраны труда и стажировки на рабочем месте с освоением необходимых операций {должность_допускаемого_в_тв} {фио_допускаемого_в_тв}"]
[]
[]
[null,"ПРИКАЗЫВАЮ:"]
{"$rows_left_out":16}
{"sheet":"МЕТКИ для шаблонов","index":9,"n_rows":44,"n_cols":8,"rows_kept":44,"cut":false,"hidden":true,"merged":[]}
["Метка","Лист, откуда брать исходное значение","Столбец","Номер столбца с исходным значением","Лист с итоговыми значениям","Столбец","Номер столбца с итоговым значением","На каком листе заменять"]
["{должность_стажируемого_в_дат}","Проведение стажировки",{"$f":"_tbl.probations[[#Headers],[Должность работника]]","v":"Должность работника"},{"$f":"MATCH(C2,INDIRECT(\"'\"&B2&\"'!1:1\"),0)","v":2},"Должности",{"$f":"_tbl.positions[[#Headers],[Склонение (дат - кому?): \nСлесарь - Слесарю]]","v":"Склонение (дат - кому?): \nСлесарь - Слесарю"},{"$f":"MATCH(F2,INDIRECT(\"'\"&E2&\"'!1:1\"),0)","v":3},"Стажировка"]
["{фио_стажируемого_в_дат}","Проведение стажировки",{"$f":"_tbl.probations[[#Headers],[Ф.И.О. работника]]","v":"Ф.И.О. работника"},{"$f":"MATCH(C3,INDIRECT(\"'\"&B3&\"'!1:1\"),0)","v":1},"Данные о работниках",{"$f":"_tbl.employees[[#Headers],[Склонение (дат - кому?): \nИванов - Иванову]]","v":"Склонение (дат - кому?): \nИванов - Иванову"},{"$f":"MATCH(F3,INDIRECT(\"'\"&E3&\"'!1:1\"),0)","v":7},"Стажировка"]
["{должность_стажируемого_в_вин}","Проведение стажировки",{"$f":"_tbl.probations[[#Headers],[Должность работника]]","v":"Должность работника"},2,"Должности",{"$f":"_tbl.positions[[#Headers],[Склонение (вин - кого?): \nСлесарь - Слесаря]]","v":"Склонение (вин - кого?): \nСлесарь - Слесаря"},{"$f":"MATCH(F4,INDIRECT(\"'\"&E4&\"'!1:1\"),0)","v":2},"Стажировка"]
["{фио_стажируемого_в_вин}","Проведение стажировки",{"$f":"_tbl.probations[[#Headers],[Ф.И.О. работника]]","v":"Ф.И.О. работника"},1,"Данные о работниках",{"$f":"_tbl.employees[[#Headers],[Склонение (вин - кого?): \nИванов - Иванова]]","v":"Склонение (вин - кого?): \nИванов - Иванова"},{"$f":"MATCH(F5,INDIRECT(\"'\"&E5&\"'!1:1\"),0)","v":6},"Стажировка"]
["{должность_стажируемого_в_тв}","Проведение стажировки",{"$f":"_tbl.probations[[#Headers],[Должность работника]]","v":"Должность работника"},{"$f":"MATCH(C6,INDIRECT(\"'\"&B6&\"'!1:1\"),0)","v":2},"Должности",{"$f":"_tbl.positions[[#Headers],[Склонение (тв - кем?): \nСлесарь - Слесарем]]","v":"Склонение (тв - кем?): \nСлесарь - Слесарем"},{"$f":"MATCH(F6,INDIRECT(\"'\"&E6&\"'!1:1\"),0)","v":4},"Стажировка"]
["{фио_стажируемого_в_тв}","Проведение стажировки",{"$f":"_tbl.probations[[#Headers],[Ф.И.О. работника]]","v":"Ф.И.О. работника"},1,"Данные о работниках",{"$f":"_tbl.employees[[#Headers],[Склонение (тв - кем?): \nИванов - Ивановым]]","v":"Склонение (тв - кем?): \nИванов - Ивановым"},8,"Стажировка"]
["{должность_ответственного_в_дат}","Проведение стажировки",{"$f":"_tbl.probations[[#Headers],[Должность ответственного за стажировку]]","v":"Должность ответственного за стажировку"},8,"Должности",{"$f":"_tbl.positions[[#Headers],[Склонение (вин - кого?): \nСлесарь - Слесаря]]","v":"Склонение (вин - кого?): \nСлесарь - Слесаря"},{"$f":"MATCH(F8,INDIRECT(\"'\"&E8&\"'!1:1\"),0)","v":2},"Стажировка"]
["{фио_ответственного_в_дат}","Проведение стажировки",{"$f":"_tbl.probations[[#Headers],[Ф.И.О. ответственного за стажировку]]","v":"Ф.И.О. ответственного за стажировку"},7,"Данные о работниках",{"$f":"_tbl.employees[[#Headers],[Склонение (вин - кого?): \nИванов - Иванова]]","v":"Склонение (вин - кого?): \nИванов - Иванова"},6,"Стажировка"]
["{должность_ответственного-за-лист_в_дат}","Проведение стажировки",{"$f":"_tbl.probations[[#Headers],[Должность ответственного за стажировочный лист]]","v":"Должность ответственного за стажировочный лист"},10,"Должности",{"$f":"_tbl.positions[[#Headers],[Склонение (дат - кому?): \nСлесарь - Слесарю]]","v":"Склонение (дат - кому?): \nСлесарь - Слесарю"},3,"Стажировка"]
["{фио_ответственного-за-лист_в_дат}","Проведение стажировки",{"$f":"_tbl.probations[[#Headers],[Ф.И.О. ответственного за стажировочный лист]]","v":"Ф.И.О. ответственного за стажировочный лист"},9,"Данные о работниках",{"$f":"_tbl.employees[[#Headers],[Склонение (дат - кому?): \nИванов - Иванову]]","v":"Склонение (дат - кому?): \nИванов - Иванову"},7,"Стажировка"]
["{должность_ответственного-за-лист_в_вин}","Проведение стажировки",{"$f":"_tbl.probations[[#Headers],[Должность ответственного за стажировочный лист]]","v":"Должность ответственного за стажировочный лист"},10,"Должности",{"$f":"_tbl.positions[[#Headers],[Склонение (вин - кого?): \nСлесарь - Слесаря]]","v":"Склонение (вин - кого?): \nСлесарь - Слесаря"},2,"Стажировка"]
["{фио_ответственного-за-лист_в_вин}","Проведение стажировки",{"$f":"_tbl.probations[[#Headers],[Ф.И.О. ответственного за стажировочный лист]]","v":"Ф.И.О. ответственного за стажировочный лист"},9,"Данные о работниках",{"$f":"_tbl.employees[[#Headers],[Склонение (вин - кого?): \nИванов - Иванова]]","v":"Склонение (вин - кого?): \nИванов - Иванова"},6,"Стажировка"]
["{должность_контролирующего_в_дат}","Проведение стажировки",{"$f":"_tbl.probations[[#Headers],[Должность контролирующего исполнение приказа]]","v":"Должность контролирующего исполнение приказа"},{"$f":"MATCH(C14,INDIRECT(\"'\"&B14&\"'!1:1\"),0)","v":12},"Должности",{"$f":"_tbl.positions[[#Headers],[Склонение (вин - кого?): \nСлесарь - Слесаря]]","v":"Склонение (вин - кого?): \nСлесарь - Слесаря"},2,"Стажировка"]
["{фио_контролирующего_в_дат}","Проведение стажировки",{"$f":"_tbl.probations[[#Headers],[Ф.И.О. контролирующего исполнение приказа]]","v":"Ф.И.О. контролирующего исполнение приказа"},{"$f":"MATCH(C15,INDIRECT(\"'\"&B15&\"'!1:1\"),0)","v":11},"Данные о работниках",{"$f":"_tbl.employees[[#Headers],[Склонение (вин - кого?): \nИванов - Иванова]]","v":"Склонение (вин - кого?): \nИванов - Иванова"},6,"Стажировка"]
{"$rows_left_out":30}
{"sheet":"Данные о работниках","index":10,"n_rows":9,"n_cols":8,"rows_kept":9,"cut":false,"hidden":false,"merged":[]}
["Ф.И.О. работника","Должность работника","Наименование подразделения (цех, участок, отдел, лаборатория, мастерская и т.д.)","Необходимость проведения стажировки","Допустить работника к самостоятельной работе","Склонение (вин - кого?): \nИванов - Иванова","Склонение (дат - кому?): \nИванов - Иванову","Склонение (тв - кем?): \nИванов - Ивановым"]
["Агафонов Илья Михайлович","Сигналист","Линейный участок № 9","+",null,"Агафонова Илью Михайловича","Агафонову Илье Михайловичу","Агафоновым Ильей Михайловичем"]
["Александров Максим Николаевич","Начальник отдела","Производственно-технический отдел","-",null,"Александрова Максима Николаевича","Александрову Максиму Николаевичу","Александровым Максимом Николаевичем"]
["Алексеев Дмитрий Андреевич","Монтер пути","Линейный участок № 11","+","+","Алекссева Дмитрия Андреевича","Алексееву Дмитрию Андреевичу","Алекссевым Дмитрием Андреевичем"]
["Алексеева Людмила Алексеевна","Ведущий технолог","Линейный участок № 3","+","+","Алексееву Людмилу Алексеевну","Алексеевой Людмиле Алексеевне","Алексеевой Людмилой Алексеевной"]
["Попов Дмитрий Сергеевич","Начальник участка","Линейный участок № 3",null,null,"Попова Дмитрия Сергеевича","Попову Дмитрию Сергеевичу","Поповым Дмитрием Сергеевичем"]
["Мальков Иван Владимирович","Начальник цеха","Цех № 7",null,null,"Малькова Ивана Владимировича","Малькову Ивану Владимировичу","Мальковым Иваном Владимировичем"]
["Иванов Иван Иванович","Начальник производственного участка","Производственный участок"]
["Петров Петр Петрович","Сигналист","Производственный участок","+","+"]

{"sheet":"Данные для протокола","index":11,"n_rows":9,"n_cols":10,"rows_kept":9,"cut":false,"hidden":false,"merged":[]}
["№ протокола","Дата проверки знаний","Комиссия","Программа обучения","Количество часов","Ф.И.О. работника","Должность работника","Наименование подразделения (цех, участок, отдел, лаборатория, мастерская)","Результат проверки знаний","Регистрационный номер записи о проверке знаний в реестре обученных лиц"]
["12","2022-11-02","Комиссия по проверке знаний 1","Программа обучения безопасным методам и приемам выполнения работ при воздействии вредных, опасных производственных факторов, источников опасности, идентифицированных в рамках спецоценки и оценки профрисков при работе для сигналиста (программа Б)",17,"Агафонов Илья Михайлович","Сигналист","Линейный участок № 9","удовлетворительно",12]
["13","2022-11-02","Комиссия по проверке знаний 1","Программа обучения безопасным методам и приемам выполнения работ при воздействии вредных, опасных производственных факторов, источников опасности, идентифицированных в рамках спецоценки и оценки профрисков при работе для монтера пути (программа Б)",17,"Алексеев Дмитрий Андреевич","Монтер пути","Линейный участок № 11"]
[null,null,null,null,null,"Алексеева Людмила Алексеевна","Ведущий технолог","Линейный участок № 3"]
[null,null,null,null,null,"Александров Максим Николаевич","Начальник отдела","Производственно-технический отдел"]
[null,null,null,null,null,"Попов Дмитрий Сергеевич","Начальник участка","Линейный участок № 3"]
[null,null,null,null,null,"Мальков Иван Владимирович","Начальник цеха","Цех № 7"]
[null,null,null,null,null,"Иванов Иван Иванович","Начальник производственного участка","Производственный участок"]
[null,null,null,null,null,"Петров Петр Петрович","Сигналист","Производственный участок"]

{"sheet":"Комиссия","index":12,"n_rows":8,"n_cols":11,"rows_kept":8,"cut":false,"hidden":false,"merged":[[0,3,0,4],[0,5,0,6],[0,7,0,8]]}
[null,null,null,"Председатель",null,"Член комиссии 1",null,"Член комиссии 2"]
["Комиссия","Дата приказа о назначении комиссии","Номер приказа","Должность","Ф.И.О","Должность ","Ф.И.О ","Должность  ","Ф.И.О  "]
["Комиссия по проверке знаний 1","2022-09-01","01/11-2022","главный инженер","Чубарев Сергей Петрович","руководитель производственного отдела","Татаркин Олег Петрович","руководитель службы охраны труда","Островская Оксана Викторовна"]
["Комиссия 2"]
["Комиссия 3"]
[null,null,null,null,null,null,null,null,null,null,""]
[]
[null,null,null,null,null,null,null,null,null,null,""]

{"sheet":"Программы обучения","index":13,"n_rows":4,"n_cols":3,"rows_kept":4,"cut":false,"hidden":false,"merged":[]}
["Наименование программы","Количество часов","Периодичность"]
["Программа обучения безопасным методам и приемам выполнения работ при воздействии вредных, опасных производственных факторов, источников опасности, идентифицированных в рамках спецоценки и оценки профрисков при работе для монтера пути (программа Б)",17,"Раз в три года"]
["Программа обучения безопасным методам и приемам выполнения работ при воздействии вредных, опасных производственных факторов, источников опасности, идентифицированных в рамках спецоценки и оценки профрисков при работе для сигналиста (программа Б)",17,"Раз в три года"]
["Программа обучения безопасным методам и приемам выполнения работ по монтажу и демонтажу технологического оборудования (программа В)",20,"Раз в год"]

{"sheet":"Проведение стажировки","index":14,"n_rows":5,"n_cols":14,"rows_kept":5,"cut":false,"hidden":false,"merged":[]}
["Ф.И.О. работника","Должность работника","Наименование подразделения (цех, участок, отдел, лаборатория, мастерская и т.д.)","Продолжительность стажировки (количество дней)","Дата начала стажировки","Дата окончания стажировки","Ф.И.О. ответственного за стажировку","Должность ответственного за стажировку","Ф.И.О. ответственного за стажировочный лист","Должность ответственного за стажировочный лист","Ф.И.О. контролирующего исполнение приказа","Должность контролирующего исполнение приказа","№ приказа","Дата приказа"]
["Агафонов Илья Михайлович","Сигналист","Линейный участок № 9",3,"2022-11-03","2022-11-07","Попов Дмитрий Сергеевич","Начальник участка ","Алексеева Людмила Алексеевна","Ведущий технолог","Мальков Иван Владимирович","Начальник цеха","23/ст","2022-11-02"]
["Алексеев Дмитрий Андреевич","Монтер пути","Линейный участок № 11"]
["Алексеева Людмила Алексеевна","Ведущий технолог","Линейный участок № 3"]
["Петров Петр Петрович","Сигналист","Производственный участок"]

{"sheet":"Решение о допуске к работе","index":15,"n_rows":4,"n_cols":8,"rows_kept":4,"cut":false,"hidden":false,"merged":[]}
["Ф.И.О. работника","Должность работника","Наименование подразделения (цех, участок, отдел, лаборатория, мастерская и т.д.)","Дата допуска к самостоятельной работе","Ф.И.О. контролирующего исполнение приказа","Должность контролирующего исполнение приказа","№ приказа","Дата приказа"]
["Алексеева Людмила Алексеевна","Ведущий технолог","Линейный участок № 3","2022-11-09","Попов Дмитрий Сергеевич","Начальник участка","445","2022-11-08"]
["Алексеев Дмитрий Андреевич","Монтер пути","Линейный участок № 11"]
["Петров Петр Петрович","Сигналист","Производственный участок"]

{"sheet":"Настройки напоминаний","index":16,"n_rows":15,"n_cols":4,"rows_kept":15,"cut":false,"hidden":false,"merged":[]}
[]
[]
[]
[null,"Напомнить об инструктажах"]
[]
["За",5,"дней","зеленым цветом в контрольном листе"]
[]
["За",3,"дней","красным цветом в контрольном листе"]
[]
[]
[null,"Напомнить о проверке знаний "]
[]
["За",10,"дней","зеленым цветом в контрольном листе"]
[]
["За",5,"дней","красным цветом в контрольном листе"]
{"$rows_left_out":1}
{"sheet":"Должности","index":17,"n_rows":7,"n_cols":4,"rows_kept":7,"cut":false,"hidden":false,"merged":[]}
["Должность работника","Склонение (вин - кого?): \nСлесарь - Слесаря","Склонение (дат - кому?): \nСлесарь - Слесарю","Склонение (тв - кем?): \nСлесарь - Слесарем"]
["Сигналист","Сигналиста","Сигналисту","Сигналистом"]
["Ведущий технолог","Ведущего технолога","Ведущему технологу","Ведущему технологу"]
["Монтер пути","Монтера пути","Монтеру пути","Монтером пути"]
["Начальник отдела","Начальника отдела","Начальнику отдела","Начальником отдела"]
["Начальник участка","Начальника участка","Начальнику участка","Начальником участка"]
["Начальник цеха","Начальника цеха","Начальнику цеха","Начальником цеха"]

{"sheet":"Руководители подразделений","index":18,"n_rows":15,"n_cols":3,"rows_kept":15,"cut":false,"hidden":true,"merged":[]}
["ФИО руководителя подразделения","Должность руководителя подразделения","Подразделение"]
["Виноградову Д.Н.","Дорожному мастеру","линейный участок №1"]
["Гудкову А.Н.","Дорожному мастеру","линейный участок №2"]
["Кострюкову Д.В.","Дорожному мастеру","линейный участок №3"]
["Новикову Г.И.","Дорожному мастеру","линейный участок №4"]
["Деткову А.Г.","Дорожному мастеру","линейный участок №5"]
["Деменкову В.В.","Дорожному мастеру","линейный участок №6"]
["Савочкину А.А.","Дорожному мастеру","линейный участок №7"]
["Трашкову Г.А.","Дорожному мастеру","линейный участок №8"]
["Назаренко А.В.","Дорожному мастеру","линейный участок №9"]
["Макарову Д.А.","Дорожному мастеру","линейный участок №10"]
["Михайлову Ю.О.","Дорожному мастеру","линейный участок №11"]
["Богданову И.Ю.","Дорожному мастеру","линейный участок №12"]
["Воробьеву В.В.","Дорожному мастеру","линейный участок №13"]
["Степанову А.Н.","Дорожному мастеру","линейный участок №14"]